{"text_format":"1","workbook":"xlsx","n_sheets":8,"sheets":["Scope","ErP Inputs","LOW SPER","MEDIUM SPER","HIGH SPER","VERY HIGH SPER","Table 37","Version Control"],"not_rendered":{"charts":13,"images":7,"macros":1,"external_links":2,"defined_names":126,"comments":0,"pivot_tables":0},"unopened":[],"bounds":{"document_bytes":16777216,"sheet_cells":100000,"rows_first":2000,"rows_last":500,"rows_between":2000,"halvings":0,"cell_chars":16384,"cell_head_chars":4096},"cells_cut":0,"cells_raw":0,"read":"whole","date_system":"1900"}

{"sheet":"Scope","index":0,"n_rows":14,"n_cols":2,"rows_kept":14,"cut":false,"hidden":false,"merged":[[7,1,7,5],[9,1,9,4],[11,1,11,4],[13,1,13,4]]}
[]
[null,"MCS 027 - SPER AND SSHEE CALCULATOR "]
[]
[]
[]
[]
[]
[null,"This calculator can only be used for calculating the Seasonal Space Heating Energy Efficiency (SSHEE) and Seasonal Primary Energy Ratio (SPERh) for Air to Water and Water / Brine to Water heat pumps under the average climate conditions defined by Commission Regulation (EU) No. 813/2013"]
[]
[null,"MCS Certification Bodies may use the calculator when certifying products against the requirements of MCS 007 - (Product certification scheme requirements - Heat pumps). "]
[]
[null,"Data calculated in accordance with this calculator will be published within the product search section of the MCS database. Please visit http://www.mcscertified.com"]
[]
[null,"The calculator is designed for use as an Microsoft Excel Macro-Enabled workbook."]

{"sheet":"ErP Inputs","index":1,"n_rows":96,"n_cols":33,"rows_kept":96,"cut":false,"hidden":false,"merged":[[44,14,47,25],[0,1,0,15],[7,4,7,15],[17,14,17,15],[16,4,16,15],[13,6,13,13],[14,6,14,7],[14,8,14,9],[14,10,14,11],[14,12,14,13],[15,2,15,5],[43,2,47,2],[43,1,47,1],[18,2,22,2],[28,2,32,2],[18,1,32,1],[23,2,27,2],[52,4,52,5],[53,4,53,5],[54,4,54,5],[55,4,55,5],[51,4,51,5]]}
[null,"This calculator can only be used for calculating the Seasonal Space Heating Energy Efficiency (SSHEE) and Seasonal Primary Energy Ratio (SPERh) for Air to Water and Water / Brine to Water heat pumps under the average climate conditions defined by Commission Regulation (EU) No. 813/2013"]
["Grace Davies 27/08/11"]
[null,null,null,null,null,null,null,null,null,null,null,null,"Key"]
[null,1,"Heat Generator?","Air Source",null,null,null,null,null,null,null,null,null,"Input Required"]
[null,2,"Temperature Control?","Variable Outlet",null,null,null,null,null,null,null,null,null,"Calculated Outcomes"]
[null,3,"Has the manufacturer provided data to demonstrate that the heat pump can reach a flow temperature of 52oC at Condition A according to the relevant product table within EN 12309 for the average climate and high temperature application?","Yes"]
[null,4,"Has the manufacturer provided data to demonstrate that the heat pump can reach a flow temperature of 61oC or greater at an inlet dry (wet) bulb temperature of -7oC (-8oC) for ASHP OR Brine 0oC for Ground Source OR Water 10oC for Water Source Heat Pumps","Yes"]
[null,null,"Classification under ErP",{"$f":"IF(D6=\"Yes\",\"Heat Pump\",\"Low Temperature Heat Pump\")","v":"Heat Pump"},{"$f":"IF(AND(D8=\"Low Temperature Heat Pump\",D9=\"Very High Temperature Heat Pump\"),\"Test data for VHTHP's signifies a flow temperautre greater than 52oC for ErP classification, Change D6 to YES\",\"\")","v":""}]
[null,null,"Classification under MCS",{"$f":"IF(AND(D6=\"No\",D7=\"No\"),\"Low Temperature Heat Pump\",IF(AND(D6=\"Yes\",D7=\"No\"),\"Heat Pump\",\"Very High Temperature Heat Pump\"))","v":"Very High Temperature Heat Pump"}]
[null,null,"Energy Label (Space Heater Only) to display SSHEE at",{"$f":"IF(D8=\"Heat Pump\",\"55oC and 35oC\",\"35oC\")","v":"55oC and 35oC"}]
[null,"Notes:","Low Temperature Heat Pumps only need to supply test data to 35oC",null,null,null,null,null,null,null,null,null,null,null,null,null,null,null,null,null,null,null,null,null,null,null,null,"Air Source"]
[null,null,"Heat Pumps must supply test data at 35oC and 55oC",null,null,null,null,null,null,null,null,null,null,null,null,null,null,null,null,null,null,null,null,null,null,null,null,"Ground Source"]
[null,null,"Very High Temperature Heat Pumps must supply test data to 35oC, 55oC and 65oC",null,null,null,null,null,null,null,null,null,null,null,null,null,null,null,null,null,null,null,null,null,null,null,null,"Water Source"]
[null,null,null,null,null,null,"Flow Temperature (oC)",null,null,null,null,null,null,null,null,null,null,null,null,null,null,null,null,null,null,null,null,"Fixed Outlet"]
[null,null,null,null,null,null,35,null,45,null,55,null,65,null,null,null,null,null,null,null,null,null,null,null,null,null,null,"Variable Outlet"]
[null,null,"Rated Heat Output including the rated heat output of any supplementary heater under average climate conditions (kW)",null,null,null,null,null,null,null,null,null,null,null,"To be provided @ Tdesignh",null,null,null,null,null,null,null,null,null,null,null,null,"Yes"]
[null,null,null,null,null,null,null,null,null,null,null,null,null,null,null,null,null,null,null,null,null,null,null,null,null,null,null,"No"]
[null,null,"All entries to 3 significant figures","Test Conditions EN 12309:2014",{"$f":"(16-(-7))/26","v":0.88461538461538458},"A",{"$f":"(16-2)/26","v":0.53846153846153844},"B",{"$f":"(16-7)/26","v":0.34615384615384615},"C",{"$f":"(16-12)/26","v":0.15384615384615385},"D",{"$f":"(16-(-10))/26","v":1},"E*"]
[null,"Product Performance Data","Low Temperature Application (35oC)\nEN 12309-6:2014 - Table 5 (ASHP) or\nTable 17 (GSHP)",null,{"$f":"IF($D$4=\"Ground Source\",\"B0 / W\",IF($D$4=\"Air Source\",\"A-7 / W\",\"W10 / W\"))","v":"A-7 / W"},{"$f":"IF($D$5=\"Variable Outlet\",VLOOKUP(\"Low\",$AB$24:$AG$28,3,FALSE),VLOOKUP(\"Low\",$AB$24:$AG$28,2,FALSE))","v":34},{"$f":"IF($D$4=\"Ground Source\",\"B0 / W\",IF($D$4=\"Air Source\",\"A2 / W\",\"W10 / W\"))","v":"A2 / W"},{"$f":"IF($D$5=\"Variable Outlet\",VLOOKUP(\"Low\",$AB$24:$AG$28,4,FALSE),VLOOKUP(\"Low\",$AB$24:$AG$28,2,FALSE))","v":30},{"$f":"IF($D$4=\"Ground Source\",\"B0 / W\",IF($D$4=\"Air Source\",\"A7 / W\",\"W10 / W\"))","v":"A7 / W"},{"$f":"IF($D$5=\"Variable Outlet\",VLOOKUP(\"Low\",$AB$24:$AG$28,5,FALSE),VLOOKUP(\"Low\",$AB$24:$AG$28,2,FALSE))","v":27},{"$f":"IF($D$4=\"Ground Source\",\"B0 / W\",IF($D$4=\"Air Source\",\"A12 / W\",\"W10 / W\"))","v":"A12 / W"},{"$f":"IF($D$5=\"Variable Outlet\",VLOOKUP(\"Low\",$AB$24:$AG$28,6,FALSE),VLOOKUP(\"Low\",$AB$24:$AG$28,2,FALSE))","v":24},{"$f":"IF($D$4=\"Ground Source\",\"B0 / W\",IF($D$4=\"Air Source\",\"A-10 / W\",\"W10 / W\"))","v":"A-10 / W"},{"$f":"IF($D$5=\"Variable Outlet\",VLOOKUP(\"Low\",$AB$24:$AG$28,2,FALSE),VLOOKUP(\"Low\",$AB$24:$AG$28,2,FALSE))","v":35}]
[null,null,null,"Heating Capacity (kW)",{"$f":"$G$16*E$18","v":0},null,{"$f":"$G$16*G$18","v":0},null,{"$f":"$G$16*I$18","v":0},null,{"$f":"$G$16*K$18","v":0},null,{"$f":"$G$16*M$18","v":0},null,null,null,null,null,null,null,null,null,null,null,null,null,null,null,"Average Climate"]
{"$rows_left_out":77}
{"sheet":"LOW SPER","index":2,"n_rows":61,"n_cols":17,"rows_kept":61,"cut":false,"hidden":false,"merged":[]}
[]
[]
[]
[null,null,"Summary"]
[null,null,"Climate ","Average",null,null,null,null,null,"Table 1 Number of hours used for heating only - Average Climate",null,null,null,null,"Thermostat-off power PTO",{"$f":"'ErP Inputs'!$D$39","v":0},"kW"]
[null,null,"Tdesignh",-10,"oC",null,null,null,null,"On mode","Thermostat-off mode HTO","Standby mode HSB","Off mode HOFF",null,"Stand by power PSB",{"$f":"'ErP Inputs'!$D$40","v":0},"kW"]
[null,null,"Property Full load (Pdesignh)",{"$f":"'ErP Inputs'!G16","v":0},"kW",null,null,null,"Average Climate (h/y)",{"$f":"M59","v":2065.6153846153843},178,0,3672,null,"Off power POFF",{"$f":"'ErP Inputs'!$D$41","v":0},"kW"]
[null,null,"Primgas",1,null,null,null,null,null,null,null,null,null,null,"Qrefh = Pdesignh x HHE",{"$f":"D7*J7","v":0}]
[null,null,"Primelec",2.5,null,null,null,null,null,null,null,null,null,null,"SAEFh",{"$f":"P8/(P8/M29+K7*P5+L7*P6+M7*P7)","v":{"$error":"#DIV/0!"}}]
[]
[null,null,{"$f":"'ErP Inputs'!D4","v":"Air Source"},null,null,null,null,null,null,null,null,null,null,null,"SPERh",{"$f":"1/(D8/M28+D9/P9)","v":{"$error":"#DIV/0!"}}]
[null,null,{"$f":"'ErP Inputs'!D5","v":"Variable Outlet"}]
[null,null,null,null,null,null,null,null,null,null,null,null,null,null,"Correction Factor F(1)",3,"%"]
[null,null,"Part Load Ratio",null,null,{"$f":"IF(D5=\"Average\",\"(Tj-16) / (-10-16) %\",IF(D5=\"Warmer\",\"(Tj-16) / (+2-16) %\",\"(Tj-16) / (-22-16) %\"))","v":"(Tj-16) / (-10-16) %"},null,null,null,null,null,null,null,null,"Correction Factor F(2)",{"$f":"IF(C11=\"Ground Source\",2,IF(C11=\"Water Source\",1,0))","v":0},"%"]
[null,null,null,null,null,null,null,null,null,null,null,null,null,null,"Correction Factor SF(i)",{"$f":"P13+P14","v":3},"%"]
[]
[null,null,"Condition","Bin Temperature","Outdoor heat exchanger","Indoor Heat exchanger","Part Load Ratio","Part Load","GUEhPL(Tj)\n(GCV)","AEFhPL(Tj)","Capacity Ratio","Declared Capacity",null,null,"Seasonal Space Heating Energy Efficiency",{"$f":"100*P11-P15","v":{"$error":"#DIV/0!"}}]
[null,null,null,null,null,null,"%","kW",null,null,"CR","kW"]
[null,null,null,-15,{"$f":"IF($D$5=\"Average\",\"Not Applicable\",IF($D$5=\"Warmer\",\"Not Applicable\",IF($D$5=\"Colder\",(minus15-16)/(Tdesignh-16),\"Check Value\")))","v":"Not Applicable"},{"$f":"IF($D$5=\"Average\",\"Not Applicable\",IF($D$5=\"Warmer\",\"Not Applicable\",IF($D$5=\"Colder\",(minus15-16)/(Tdesignh-16),\"Check Value\")))","v":"Not Applicable"},null,null,null,null,null,null,null,null,"Seasonal Space Heating Energy Efficiency class",{"$f":"IF(P17>=175,\"A+++\",IF(AND(P17<175,P17>=150),\"A++\",IF(AND(P17<150,P17>=123),\"A+\",IF(AND(P17<123,P17>=115),\"A\",IF(AND(P17<115,P17>=107),\"B\",IF(AND(P17<107,P17>=100),\"C\",IF(AND(P17<100,P17>=61),\"D\",IF(AND(P17<61,P17>=59),\"E\",IF(AND(P17<59,P17>=55),\"F\",\"G\")))))))))","v":{"$error":"#DIV/0!"}}]
[null,null," E (TOL)",{"$f":"IF('ErP Inputs'!D38>-10,-10,IF('ErP Inputs'!D38<Tdesignh,Tdesignh,D10))","v":-10},{"$f":"IF('ErP Inputs'!D4=\"Ground Source\",0,IF('ErP Inputs'!D4=\"Air Source\",-10,10))","v":-10},{"$f":"'ErP Inputs'!N19","v":35},{"$f":"(D20-16)/(Tdesignh-16)","v":1},{"$f":"G20*$D$7","v":0},{"$f":"'ErP Inputs'!M21","v":0},{"$f":"'ErP Inputs'!M22","v":0},{"$f":"IF('ErP Inputs'!M23>0,'ErP Inputs'!M23,\"NA\")","v":"NA"},{"$f":"IF(K20=\"NA\",\"NA\",H20/K20)","v":"NA"}]
{"$rows_left_out":42}
{"sheet":"MEDIUM SPER","index":3,"n_rows":61,"n_cols":17,"rows_kept":61,"cut":false,"hidden":false,"merged":[]}
[]
[]
[]
[null,null,"Summary"]
[null,null,"Climate ","Average",null,null,null,null,null,"Table 1 Number of hours used for heating only - Average Climate",null,null,null,null,"Thermostat-off power PTO",{"$f":"'ErP Inputs'!$D$39","v":0},"kW"]
[null,null,"Tdesignh",-10,"oC",null,null,null,null,"On mode","Thermostat-off mode HTO","Standby mode HSB","Off mode HOFF",null,"Stand by power PSB",{"$f":"'ErP Inputs'!$D$40","v":0},"kW"]
[null,null,"Property Full load (Pdesignh)",{"$f":"'ErP Inputs'!I16","v":0},"kW",null,null,null,"Average Climate (h/y)",{"$f":"M59","v":2065.6153846153843},178,0,3672,null,"Off power POFF",{"$f":"'ErP Inputs'!$D$41","v":0},"kW"]
[null,null,"Primgas",1,null,null,null,null,null,null,null,null,null,null,"Qrefh = Pdesignh x HHE",{"$f":"D7*J7","v":0}]
[null,null,"Primelec",2.5,null,null,null,null,null,null,null,null,null,null,"SAEFh",{"$f":"P8/(P8/M29+K7*P5+L7*P6+M7*P7)","v":{"$error":"#DIV/0!"}}]
[]
[null,null,{"$f":"'ErP Inputs'!D4","v":"Air Source"},null,null,null,null,null,null,null,null,null,null,null,"SPERh",{"$f":"1/(D8/M28+D9/P9)","v":{"$error":"#DIV/0!"}}]
[null,null,{"$f":"'ErP Inputs'!D5","v":"Variable Outlet"}]
[null,null,null,null,null,null,null,null,null,null,null,null,null,null,"Correction Factor F(1)",3,"%"]
[null,null,"Part Load Ratio",null,null,{"$f":"IF(D5=\"Average\",\"(Tj-16) / (-10-16) %\",IF(D5=\"Warmer\",\"(Tj-16) / (+2-16) %\",\"(Tj-16) / (-22-16) %\"))","v":"(Tj-16) / (-10-16) %"},null,null,null,null,null,null,null,null,"Correction Factor F(2)",{"$f":"IF(C11=\"Ground Source\",2,IF(C11=\"Water Source\",1,0))","v":0},"%"]
[null,null,null,null,null,null,null,null,null,null,null,null,null,null,"Correction Factor SF(i)",{"$f":"P13+P14","v":3},"%"]
[]
[null,null,"Condition","Bin Temperature","Outdoor heat exchanger","Indoor Heat exchanger","Part Load Ratio","Part Load","GUEhPL(Tj)\n(GCV)","AEFhPL(Tj)","Capacity Ratio","Declared Capacity",null,null,"Seasonal Space Heating Energy Efficiency",{"$f":"100*P11-P15","v":{"$error":"#DIV/0!"}}]
[null,null,null,null,null,null,"%","kW",null,null,"CR","kW"]
[null,null,null,-15,{"$f":"IF($D$5=\"Average\",\"Not Applicable\",IF($D$5=\"Warmer\",\"Not Applicable\",IF($D$5=\"Colder\",(minus15-16)/(Tdesignh-16),\"Check Value\")))","v":"Not Applicable"},{"$f":"IF($D$5=\"Average\",\"Not Applicable\",IF($D$5=\"Warmer\",\"Not Applicable\",IF($D$5=\"Colder\",(minus15-16)/(Tdesignh-16),\"Check Value\")))","v":"Not Applicable"},null,null,null,null,null,null,null,null,"Seasonal Space Heating Energy Efficiency class",{"$f":"IF('ErP Inputs'!D8=\"Low Temperature Heat Pump\",IF(P17>=175,\"A+++\",IF(AND(P17<175,P17>=150),\"A++\",IF(AND(P17<150,P17>=123),\"A+\",IF(AND(P17<123,P17>=115),\"A\",IF(AND(P17<115,P17>=107),\"B\",IF(AND(P17<107,P17>=100),\"C\",IF(AND(P17<100,P17>=61),\"D\",IF(AND(P17<61,P17>=59),\"E\",IF(AND(P17<59,P17>=55),\"F\",\"G\"))))))))),IF(P17>=150,\"A+++\",IF(AND(P17<150,P17>=125),\"A++\",IF(AND(P17<125,P17>=98),\"A+\",IF(AND(P17<98,P17>=90),\"A\",IF(AND(P17<90,P17>=82),\"B\",IF(AND(P17<82,P17>=75),\"C\",IF(AND(P17<75,P17>=36),\"D\",IF(AND(P17<36,P17>=34),\"E\",IF(AND(P17<34,P17>=30),\"F\",\"G\"))))))))))","v":{"$error":"#DIV/0!"}}]
[null,null," E (TOL)",{"$f":"IF('ErP Inputs'!D38>-10,-10,IF('ErP Inputs'!D38<Tdesignh,Tdesignh,D10))","v":-10},{"$f":"IF('ErP Inputs'!D4=\"Ground Source\",0,IF('ErP Inputs'!D4=\"Air Source\",-10,10))","v":-10},{"$f":"'ErP Inputs'!N44","v":45},{"$f":"(D20-16)/(Tdesignh-16)","v":1},{"$f":"G20*$D$7","v":0},{"$f":"IF('ErP Inputs'!M46=\"\",(('HIGH SPER'!I20+'LOW SPER'!I20)*0.5),'ErP Inputs'!M46)","v":0},{"$f":"IF('ErP Inputs'!M47=\"\",(('HIGH SPER'!J20+'LOW SPER'!J20)*0.5),'ErP Inputs'!M47)","v":0},{"$f":"IF('ErP Inputs'!M48>0,'ErP Inputs'!M48,\"NA\")","v":"NA"},{"$f":"IF(K20=\"NA\",\"NA\",H20/K20)","v":"NA"}]
{"$rows_left_out":42}
{"sheet":"HIGH SPER","index":4,"n_rows":61,"n_cols":17,"rows_kept":61,"cut":false,"hidden":false,"merged":[]}
[]
[]
[]
[null,null,"Summary"]
[null,null,"Climate ","Average",null,null,null,null,null,"Table 1 Number of hours used for heating only - Average Climate",null,null,null,null,"Thermostat-off power PTO",{"$f":"'ErP Inputs'!$D$39","v":0},"kW"]
[null,null,"Tdesignh",-10,"oC",null,null,null,null,"On mode","Thermostat-off mode HTO","Standby mode HSB","Off mode HOFF",null,"Stand by power PSB",{"$f":"'ErP Inputs'!$D$40","v":0},"kW"]
[null,null,"Property Full load (Pdesignh)",{"$f":"'ErP Inputs'!K16","v":0},"kW",null,null,null,"Average Climate (h/y)",{"$f":"M59","v":2065.6153846153843},178,0,3672,null,"Off power POFF",{"$f":"'ErP Inputs'!$D$41","v":0},"kW"]
[null,null,"Primgas",1,null,null,null,null,null,null,null,null,null,null,"Qrefh = Pdesignh x HHE",{"$f":"D7*J7","v":0}]
[null,null,"Primelec",2.5,null,null,null,null,null,null,null,null,null,null,"SAEFh",{"$f":"P8/(P8/M29+K7*P5+L7*P6+M7*P7)","v":{"$error":"#DIV/0!"}}]
[]
[null,null,{"$f":"'ErP Inputs'!D4","v":"Air Source"},null,null,null,null,null,null,null,null,null,null,null,"SPERh",{"$f":"1/(D8/M28+D9/P9)","v":{"$error":"#DIV/0!"}}]
[null,null,{"$f":"'ErP Inputs'!D5","v":"Variable Outlet"}]
[null,null,null,null,null,null,null,null,null,null,null,null,null,null,"Correction Factor F(1)",3,"%"]
[null,null,"Part Load Ratio",null,null,{"$f":"IF(D5=\"Average\",\"(Tj-16) / (-10-16) %\",IF(D5=\"Warmer\",\"(Tj-16) / (+2-16) %\",\"(Tj-16) / (-22-16) %\"))","v":"(Tj-16) / (-10-16) %"},null,null,null,null,null,null,null,null,"Correction Factor F(2)",{"$f":"IF(C11=\"Ground Source\",2,IF(C11=\"Water Source\",1,0))","v":0},"%"]
[null,null,null,null,null,null,null,null,null,null,null,null,null,null,"Correction Factor SF(i)",{"$f":"P13+P14","v":3},"%"]
[]
[null,null,"Condition","Bin Temperature","Outdoor heat exchanger","Indoor Heat exchanger","Part Load Ratio","Part Load","GUEhPL(Tj)\n(GCV)","AEFhPL(Tj)","Capacity Ratio","Declared Capacity",null,null,"Seasonal Space Heating Energy Efficiency",{"$f":"100*P11-P15","v":{"$error":"#DIV/0!"}}]
[null,null,null,null,null,null,"%","kW",null,null,"CR","kW"]
[null,null,null,-15,{"$f":"IF($D$5=\"Average\",\"Not Applicable\",IF($D$5=\"Warmer\",\"Not Applicable\",IF($D$5=\"Colder\",(minus15-16)/(Tdesignh-16),\"Check Value\")))","v":"Not Applicable"},{"$f":"IF($D$5=\"Average\",\"Not Applicable\",IF($D$5=\"Warmer\",\"Not Applicable\",IF($D$5=\"Colder\",(minus15-16)/(Tdesignh-16),\"Check Value\")))","v":"Not Applicable"},null,null,null,null,null,null,null,null,"Seasonal Space Heating Energy Efficiency class",{"$f":"IF('ErP Inputs'!D8=\"Low Temperature Heat Pump\",IF(P17>=175,\"A+++\",IF(AND(P17<175,P17>=150),\"A++\",IF(AND(P17<150,P17>=123),\"A+\",IF(AND(P17<123,P17>=115),\"A\",IF(AND(P17<115,P17>=107),\"B\",IF(AND(P17<107,P17>=100),\"C\",IF(AND(P17<100,P17>=61),\"D\",IF(AND(P17<61,P17>=59),\"E\",IF(AND(P17<59,P17>=55),\"F\",\"G\"))))))))),IF(P17>=150,\"A+++\",IF(AND(P17<150,P17>=125),\"A++\",IF(AND(P17<125,P17>=98),\"A+\",IF(AND(P17<98,P17>=90),\"A\",IF(AND(P17<90,P17>=82),\"B\",IF(AND(P17<82,P17>=75),\"C\",IF(AND(P17<75,P17>=36),\"D\",IF(AND(P17<36,P17>=34),\"E\",IF(AND(P17<34,P17>=30),\"F\",\"G\"))))))))))","v":{"$error":"#DIV/0!"}}]
[null,null," E (TOL)",{"$f":"IF('ErP Inputs'!D38>-10,-10,IF('ErP Inputs'!D38<Tdesignh,Tdesignh,D10))","v":-10},{"$f":"IF('ErP Inputs'!D4=\"Ground Source\",0,IF('ErP Inputs'!D4=\"Air Source\",-10,10))","v":-10},{"$f":"'ErP Inputs'!N24","v":55},{"$f":"(D20-16)/(Tdesignh-16)","v":1},{"$f":"G20*$D$7","v":0},{"$f":"'ErP Inputs'!M26","v":0},{"$f":"'ErP Inputs'!M27","v":0},{"$f":"IF('ErP Inputs'!M28>0,'ErP Inputs'!M28,\"NA\")","v":"NA"},{"$f":"IF(K20=\"NA\",\"NA\",H20/K20)","v":"NA"}]
{"$rows_left_out":42}
{"sheet":"VERY HIGH SPER","index":5,"n_rows":61,"n_cols":17,"rows_kept":61,"cut":false,"hidden":false,"merged":[]}
[]
[]
[]
[null,null,"Summary"]
[null,null,"Climate ","Average",null,null,null,null,null,"Table 1 Number of hours used for heating only - Average Climate",null,null,null,null,"Thermostat-off power PTO",{"$f":"'ErP Inputs'!$D$39","v":0},"kW"]
[null,null,"Tdesignh",-10,"oC",null,null,null,null,"On mode","Thermostat-off mode HTO","Standby mode HSB","Off mode HOFF",null,"Stand by power PSB",{"$f":"'ErP Inputs'!$D$40","v":0},"kW"]
[null,null,"Property Full load (Pdesignh)",{"$f":"'ErP Inputs'!M16","v":0},"kW",null,null,null,"Average Climate (h/y)",{"$f":"M59","v":2065.6153846153843},178,0,3672,null,"Off power POFF",{"$f":"'ErP Inputs'!$D$41","v":0},"kW"]
[null,null,"Primgas",1,null,null,null,null,null,null,null,null,null,null,"Qrefh = Pdesignh x HHE",{"$f":"D7*J7","v":0}]
[null,null,"Primelec",2.5,null,null,null,null,null,null,null,null,null,null,"SAEFh",{"$f":"P8/(P8/M29+K7*P5+L7*P6+M7*P7)","v":{"$error":"#DIV/0!"}}]
[]
[null,null,{"$f":"'ErP Inputs'!D4","v":"Air Source"},null,null,null,null,null,null,null,null,null,null,null,"SPERh",{"$f":"1/(D8/M28+D9/P9)","v":{"$error":"#DIV/0!"}}]
[null,null,{"$f":"'ErP Inputs'!D5","v":"Variable Outlet"}]
[null,null,null,null,null,null,null,null,null,null,null,null,null,null,"Correction Factor F(1)",3,"%"]
[null,null,"Part Load Ratio",null,null,{"$f":"IF(D5=\"Average\",\"(Tj-16) / (-10-16) %\",IF(D5=\"Warmer\",\"(Tj-16) / (+2-16) %\",\"(Tj-16) / (-22-16) %\"))","v":"(Tj-16) / (-10-16) %"},null,null,null,null,null,null,null,null,"Correction Factor F(2)",{"$f":"IF(C11=\"Ground Source\",2,IF(C11=\"Water Source\",1,0))","v":0},"%"]
[null,null,null,null,null,null,null,null,null,null,null,null,null,null,"Correction Factor SF(i)",{"$f":"P13+P14","v":3},"%"]
[]
[null,null,"Condition","Bin Temperature","Outdoor heat exchanger","Indoor Heat exchanger","Part Load Ratio","Part Load","GUEhPL(Tj)\n(GCV)","AEFhPL(Tj)","Capacity Ratio","Declared Capacity",null,null,"Seasonal Space Heating Energy Efficiency",{"$f":"100*P11-P15","v":{"$error":"#DIV/0!"}}]
[null,null,null,null,null,null,"%","kW",null,null,"CR","kW"]
[null,null,null,-15,{"$f":"IF($D$5=\"Average\",\"Not Applicable\",IF($D$5=\"Warmer\",\"Not Applicable\",IF($D$5=\"Colder\",(minus15-16)/(Tdesignh-16),\"Check Value\")))","v":"Not Applicable"},{"$f":"IF($D$5=\"Average\",\"Not Applicable\",IF($D$5=\"Warmer\",\"Not Applicable\",IF($D$5=\"Colder\",(minus15-16)/(Tdesignh-16),\"Check Value\")))","v":"Not Applicable"},null,null,null,null,null,null,null,null,"Seasonal Space Heating Energy Efficiency class",{"$f":"IF('ErP Inputs'!D8=\"Low Temperature Heat Pump\",IF(P17>=175,\"A+++\",IF(AND(P17<175,P17>=150),\"A++\",IF(AND(P17<150,P17>=123),\"A+\",IF(AND(P17<123,P17>=115),\"A\",IF(AND(P17<115,P17>=107),\"B\",IF(AND(P17<107,P17>=100),\"C\",IF(AND(P17<100,P17>=61),\"D\",IF(AND(P17<61,P17>=59),\"E\",IF(AND(P17<59,P17>=55),\"F\",\"G\"))))))))),IF(P17>=150,\"A+++\",IF(AND(P17<150,P17>=125),\"A++\",IF(AND(P17<125,P17>=98),\"A+\",IF(AND(P17<98,P17>=90),\"A\",IF(AND(P17<90,P17>=82),\"B\",IF(AND(P17<82,P17>=75),\"C\",IF(AND(P17<75,P17>=36),\"D\",IF(AND(P17<36,P17>=34),\"E\",IF(AND(P17<34,P17>=30),\"F\",\"G\"))))))))))","v":{"$error":"#DIV/0!"}}]
[null,null," E (TOL)",{"$f":"IF('ErP Inputs'!D38>-10,-10,IF('ErP Inputs'!D38<Tdesignh,Tdesignh,D10))","v":-10},{"$f":"IF('ErP Inputs'!D4=\"Ground Source\",0,IF('ErP Inputs'!D4=\"Air Source\",-10,10))","v":-10},{"$f":"'ErP Inputs'!N29","v":65},{"$f":"(D20-16)/(Tdesignh-16)","v":1},{"$f":"G20*$D$7","v":0},{"$f":"'ErP Inputs'!M31","v":0},{"$f":"'ErP Inputs'!M32","v":0},{"$f":"IF('ErP Inputs'!M33>0,'ErP Inputs'!M33,\"NA\")","v":"NA"},{"$f":"IF(K20=\"NA\",\"NA\",H20/K20)","v":"NA"}]
{"$rows_left_out":42}
{"sheet":"Table 37","index":6,"n_rows":52,"n_cols":6,"rows_kept":52,"cut":false,"hidden":false,"merged":[]}
[]
[null,"Table 37 - j,Tj& hj reference heating seasons"]
[null,null,null,"Warmer","Average","Colder"]
[null,"j","Tj","hjW","hjA","hjC"]
[null,null,"°C","h","h","h"]
[null,1,-30,0,0,0]
[null,2,-29,0,0,0]
[null,3,-28,0,0,0]
[null,4,-27,0,0,0]
[null,5,-26,0,0,0]
[null,6,-25,0,0,0]
[null,7,-24,0,0,0]
[null,8,-23,0,0,0]
[null,9,-22,0,0,1]
[null,10,-21,0,0,6]
[null,11,-20,0,0,13]
[null,12,-19,0,0,17]
[null,13,-18,0,0,19]
[null,14,-17,0,0,26]
[null,15,-16,0,0,39]
{"$rows_left_out":33}
{"sheet":"Version Control","index":7,"n_rows":7,"n_cols":4,"rows_kept":7,"cut":false,"hidden":false,"merged":[]}
[]
[null,"AMENDMENTS SINCE PUBLICATION"]
[]
[null,"DATE","ISSUE","NOTES"]
[null,"2015-05-01",1,"First version published"]
[null,"2015-11-16",2,"amendement to classification of heat pumps in low temperature application (unconditioned reference to Table 2 of Regulation 811/2013)"]
[null,"2019-07-22",2.1,"Rebranding of document, update of email and website addresses and cosmetic changes."]