{"text_format":"1","workbook":"xlsx","n_sheets":5,"sheets":["Manufacturers's Declaration","REF_DATA(V1.0)","Reference Test Data"," Installation Package ","Version"],"not_rendered":{"charts":0,"images":0,"macros":1,"external_links":0,"defined_names":5,"comments":0,"pivot_tables":0},"unopened":[],"bounds":{"document_bytes":16777216,"sheet_cells":100000,"rows_first":2000,"rows_last":500,"rows_between":2000,"halvings":0,"cell_chars":16384,"cell_head_chars":4096},"cells_cut":0,"cells_raw":0,"read":"whole","date_system":"1900"}

{"sheet":"Manufacturers's Declaration","index":0,"n_rows":83,"n_cols":13,"rows_kept":83,"cut":false,"hidden":false,"merged":[[45,1,45,5],[46,1,48,1],[46,2,46,3],[7,1,7,10],[19,1,19,10],[26,1,29,1],[16,7,16,8],[16,9,16,10],[16,2,16,5],[17,2,17,5],[14,6,14,10],[15,6,15,10],[10,2,10,5],[15,2,15,5],[8,6,8,10],[9,6,9,10],[10,6,10,10],[11,6,11,10],[13,6,13,10],[82,3,82,10],[72,1,76,1],[76,6,76,7],[80,1,80,2],[81,1,81,2],[80,8,80,10],[81,8,81,10],[80,3,80,6],[81,3,81,6],[74,6,74,7],[75,6,75,7],[72,2,76,5],[71,1,71,10],[8,2,8,5],[9,2,9,5],[11,2,11,5],[12,2,12,5],[13,2,13,5],[72,6,73,7],[55,2,57,5],[55,6,56,8],[57,6,57,8],[60,2,62,5],[60,1,69,1],[51,1,57,1],[54,2,54,8],[60,6,60,7],[51,2,52,8],[53,2,53,8],[12,6,12,10],[14,2,14,5],[31,1,31,10],[41,1,41,5],[42,1,44,1],[42,2,42,3],[32,5,32,7],[32,8,33,10],[32,1,39,1],[20,2,23,3],[20,1,23,1],[25,1,25,10],[26,2,29,5]]}
[]
[null,"Micro-Cogeneration Add-on Calculator ",null,null,null,null,null,null,"Version:","v 1.0"]
[]
[null,null,"Please fill out the blanks in all tables"]
[]
[]
[]
[null,"TABLE MD1: General description of the Add-on MCU",null,null,null,null,null,null,null,null,null,null,"User input data is in blue "]
[null,1,"Manufacturer's name",null,null,null,null,null,null,null,null,null,"Dark Red figures are taken from another cell/sheet"]
[null,2,"Brand name",null,null,null,null,null,null,null,null,null,"Red figures are calculated"]
[null,3,"Package name"]
[null,4,"Unique package identifiers"]
[null,5,"Prime mover: Software/Control package version"]
[null,6,"System Integration Package: Software/Control package version"]
[null,7,"Description of micro-cogeneration package"]
[null,8,"Prime mover type"]
[null,9,"Test fuel - Select from list",null,null,null,"1  Mains Gas","If special then specify : -"]
[null,10,"Condensing or Non-Condensing - Select from list",null,null,null,"Condensing"]
[]
[null,"TABLE MD2: Operating and test regimes"]
[null,11,"Select generic type, application and operating mode",null,"Generic type","Test mode","Target building","Operation","Space heating","Standby","DHW"]
[null,null,null,null,null,null,"Types","Mode","Test regime","Mode","Only"]
[null,null,null,null,"[Select]","[Select]","[Select]","[Select]"]
[null,null,null,null,"RegPK","With Ref boiler","Single family","1  Continuous",{"$f":"+'REF_DATA(V1.0)'!U41","v":1},"Yes",{"$f":"+IF($E$24=\"HeatPK\",\"N/A\",5)","v":5}]
[]
[null,"TABLE MD3: Electrical specification"]
[null,12,"Electrical specification",null,null,null,"Maximum","Voltage","Frequency","AC/DC","Electrical test"]
[null,null,null,null,null,null,"Electrical Output",null,null,null,"Mode"]
[null,null,null,null,null,null,"[kVA]","[V]","[Hz]",null,"[Select]"]
[null,null,null,null,null,null,null,null,null,null,1]
[]
[null,"TABLE MD4: Add-on MCU Manufacturer's declared performance data"]
[null,13,null,null,null,"Return temperature, TR",null,null,"Standby mode inputs and outputs"]
[null,null,null,null,null,"60oC","45oC","30oC"]
[null,null,"Fuel energy consumption rate",null,"[kW]",null,null,null,"Power input","[We]"]
[null,null,"Thermal power output",null,"[kWt]",null,null,null,"Fuel energy input","[W]",null,null,"About Table MD4: These declared results are not necessary, but can be used by the test house to make sense of their own results."]
[null,null,"Electrical power output",null,"[kWe]",null,null,null,"Power output","[We]"]
[null,null,"Gross electrical efficiency",null,"[%]",null,null,null,"Heat output","[Wt]"]
[null,null,"Gross thermal efficiency",null,"[%]"]
[null,null,"Gross overall efficiency",null,"[%]"]
{"$rows_left_out":44}
{"sheet":"REF_DATA(V1.0)","index":1,"n_rows":69,"n_cols":21,"rows_kept":69,"cut":false,"hidden":false,"merged":[[57,12,57,13],[14,1,15,2],[33,2,33,3],[33,4,33,5],[57,2,57,3],[57,7,57,8]]}
[null,"Micro-Cogeneration Add-on Calculator ",null,null,null,null,null,null,"Version:","v 1.0"]
[]
[null,"Please only change data to match new current SAP values."]
[]
[]
[]
[null,"Table R1: Electrical test mode"]
[]
[null,"Synchronous",1]
[null,"Island Mode",2]
[]
[null,"Result",{"$f":"+'Manufacturers''s Declaration'!K30","v":1}]
[]
[null,"Table R2: Fuel types and properties"]
[null,"Fuel type",null,"Emissions","Unit price","Standing charge","Primary ",null,"Current values are from the SAP2012."]
[null,null,null,"[kgCO2/KWh]","[p/kWh]","[£/y]","Energy factor",null,"These values need updating with those values from the latest version of the SAP."]
[null,"1  Mains Gas",null,0.216,3.48,120,1.22]
[null,"2  LPG",null,0.24099999999999999,10.3,0,1.0900000000000001]
[null,"3  Heating oil",null,0.29799999999999999,5.44,0,1.1000000000000001]
[null,"4  Special"]
[null,"5  Import electricity",null,0.51900000000000002,13.19,54,3.07]
[null,"6  Export electricity",null,0.51900000000000002,13.19,0,3.07]
[null,{"$f":"+'Manufacturers''s Declaration'!G17","v":"1  Mains Gas"},null,{"$f":"+LOOKUP($B23,$B17:$B20,D17:D20)","v":0.216},{"$f":"+LOOKUP($B23,$B17:$B20,E17:E20)","v":3.48},{"$f":"+LOOKUP($B23,$B17:$B20,F17:F20)","v":120},{"$f":"+LOOKUP($B23,$B17:$B20,G17:G20)","v":1.22}]
[]
[null,"Table R3: Appliance type"]
[]
[null,"Condensing"]
[null,"Non-Condensing"]
[]
[null,{"$f":"+'Manufacturers''s Declaration'!G18","v":"Condensing"}]
[]
[null,"Table R4:  Category, Application and operating regimes"]
[null,null,null,null,null,null,null,null,null,null,"Load factor (%)",null,null,null,null,null,null,null,null,null,"Test"]
[null,"Category","Test mode",null,"Target building types",null,"Operation mode","On hours","Add-on MCU On times",null,100,90,80,70,60,50,40,30,20,10,"Regime"]
[null,"RegPK","With Ref boiler",null,"Single family",null,"1  Continuous",24,"24h",null,"Continuous","Continuous","Continuous","Continuous","Continuous","Continuous","Continuous","Continuous","Continuous","Continuous",1]
[null,"HeatPK",null,null,"Apartment blocks",null,"2  Uni-modal",16,"07:00 - 23:00",null,"Continuous","N/A","N/A","N/A","Uni-modal","Uni-modal","Uni-modal","Uni-modal","Uni-modal","Uni-modal",2]
[null,"CombiPK",null,null,"Commercial ",null,"3  Bi-modal",11,"06:00 - 09:00 & 15:00 - 2300",null,"Continuous","N/A","N/A","N/A","N/A","N/A","Bi-modal","Bi-modal","Bi-modal","Bi-modal",3]
[null,"DHWPK",null,null,null,null,"4  Uni + Bi-modal",null,"07:00 - 23:00 & 06:00 - 09:00 & 15:00 - 2300",null,"Continuous","Continuous","Continuous","Continuous","Uni-modal","Uni-modal","N/A","Uni-modal","N/A","Bi-modal",4]
[]
[null,{"$f":"+'Manufacturers''s Declaration'!E24","v":"RegPK"},{"$f":"+'Manufacturers''s Declaration'!F24","v":"With Ref boiler"},null,{"$f":"+'Manufacturers''s Declaration'!G24","v":"Single family"},null,{"$f":"+'Manufacturers''s Declaration'!H24","v":"1  Continuous"},null,{"$f":"+LOOKUP(G40,G35:G38,I35:I38)","v":"24h"},null,{"$f":"+LOOKUP($G40,$G35:$G38,K35:K38)","v":"Continuous"},{"$f":"+LOOKUP($G40,$G35:$G38,L35:L38)","v":"Continuous"},{"$f":"+LOOKUP($G40,$G35:$G38,M35:M38)","v":"Continuous"},"Continuous","Continuous","Continuous","Continuous","Continuous","Continuous","Continuous",{"$f":"+LOOKUP($G40,$G35:$G38,U35:U38)","v":1}]
{"$rows_left_out":30}
{"sheet":"Reference Test Data","index":2,"n_rows":123,"n_cols":40,"rows_kept":123,"cut":false,"hidden":false,"merged":[[53,24,53,25],[53,26,53,27],[53,29,53,31],[78,7,78,9],[78,11,78,13],[75,7,75,8],[78,14,78,15],[78,16,78,18],[78,20,78,21],[78,22,78,23],[68,29,68,31],[68,24,68,25],[68,26,68,27],[78,26,78,27],[78,29,78,31],[78,24,78,25],[53,35,53,36],[53,37,53,39],[78,35,78,36],[78,37,78,39],[78,32,78,34],[53,32,53,34],[68,32,68,34],[68,35,68,36],[68,37,68,39],[108,4,108,5],[16,8,16,9],[68,7,68,9],[27,4,27,6],[27,7,28,9],[87,7,87,8],[50,7,50,8],[52,1,52,6],[39,1,41,3],[40,5,40,7],[39,5,39,9],[44,1,44,3],[45,1,45,3],[46,1,47,3],[67,1,67,6],[9,1,9,3],[16,5,16,7],[16,1,17,2],[14,6,14,7],[65,7,65,8],[53,7,53,9],[25,6,25,7],[17,5,17,6],[90,16,90,18],[10,1,10,3],[11,1,11,3],[52,12,52,13],[53,11,53,13],[53,14,53,15],[53,16,53,18],[37,12,37,13],[77,11,77,12],[90,8,90,9],[16,10,16,11],[40,10,40,12],[39,10,39,14],[16,12,16,13],[67,12,67,13],[68,22,68,23],[53,20,53,21],[53,22,53,23],[68,11,68,13],[68,14,68,15],[68,16,68,18],[68,20,68,21]]}
[]
[null,{"$f":"+'Manufacturers''s Declaration'!B2","v":"Micro-Cogeneration Add-on Calculator "},null,null,"Version: ",{"$f":"+'Manufacturers''s Declaration'!J2","v":"v 1.0"},null,"Add-on MCU PERFORMANCE DATA WITH  REFERENCE BOILER"]
[]
[]
[]
[null,"TABLE RT_01:    FUEL PARAMETERS"]
[]
[null,null,null,null,"Fuel","Emissions","Price","Standing charge","Primary "]
[null,null,null,null,null,"[kgCO2/kWh]","[p/kWh]","[£/y]","Energy factor"]
[null,"Add-on MCU and reference test boiler",null,null,{"$f":"+'Manufacturers''s Declaration'!G17","v":"1  Mains Gas"},{"$f":"+'REF_DATA(V1.0)'!D23","v":0.216},{"$f":"+'REF_DATA(V1.0)'!E23","v":3.48},{"$f":"+'REF_DATA(V1.0)'!F23","v":120},{"$f":"+'REF_DATA(V1.0)'!G23","v":1.22}]
[null,"Import power",null,null,"Electricity",{"$f":"+'REF_DATA(V1.0)'!D21","v":0.51900000000000002},{"$f":"+'REF_DATA(V1.0)'!E21","v":13.19},{"$f":"+'REF_DATA(V1.0)'!F21","v":54},{"$f":"+'REF_DATA(V1.0)'!G21","v":3.07}]
[null,"Export power",null,null,"Electricity",{"$f":"+'REF_DATA(V1.0)'!D22","v":0.51900000000000002},{"$f":"+'REF_DATA(V1.0)'!E22","v":13.19},{"$f":"+'REF_DATA(V1.0)'!F22","v":0},{"$f":"+'REF_DATA(V1.0)'!G22","v":3.07}]
[]
[]
[null,"TABLE RT_02:    REFERENCE BOILER DATA",null,null,null,null,"Add-on MCU type:  ",null,{"$f":"+'Manufacturers''s Declaration'!$E$24","v":"RegPK"},{"$f":"+'Manufacturers''s Declaration'!$F$24","v":"With Ref boiler"}]
[]
[null,"Make & Model",null,"SH output power at 70 - 80oC [kW]",null,"SAP seasonal efficiency [%]",null,null,"Electrical power consumption [W]",null,"Temperature rise [oC]",null,"DHW tank"]
[null,null,null,"Maximum","Minimum","Annual",null,"DHW ","Firing mode","Standby mode","Max power","Min power","Size (L)","Heat Loss at 45∆T(W)"]
[null,null,null,{"$f":"+'Manufacturers''s Declaration'!C45","v":0},{"$f":"+'Manufacturers''s Declaration'!D45","v":0}]
[]
[]
[]
[]
[]
[]
[null,"TABLE RT_03:    Add-on MCU MANUFACTURER'S PERFORMANCE DATA",null,null,null,null,"Add-on MCU type:  ",null,{"$f":"+'Manufacturers''s Declaration'!$E$24","v":"RegPK"},{"$f":"+'Manufacturers''s Declaration'!$F$24","v":"With Ref boiler"}]
[]
[null,null,null,null,"Return temperature, TR",null,null,"Standby mode inputs and outputs"]
[null,null,null,null,"60oC","45oC","30oC"]
[null,"Fuel energy consumption rate",null,"[kW]",{"$f":"+'Manufacturers''s Declaration'!F35","v":0},{"$f":"+'Manufacturers''s Declaration'!G35","v":0},{"$f":"+'Manufacturers''s Declaration'!H35","v":0},"Power input","[We]",{"$f":"+'Manufacturers''s Declaration'!K35","v":0}]
[null,"Thermal power output",null,"[kWt]",{"$f":"+'Manufacturers''s Declaration'!F36","v":0},{"$f":"+'Manufacturers''s Declaration'!G36","v":0},{"$f":"+'Manufacturers''s Declaration'!H36","v":0},"Fuel energy input","[W]",{"$f":"+'Manufacturers''s Declaration'!K36","v":0}]
[null,"Electrical power output",null,"[kWe]",{"$f":"+'Manufacturers''s Declaration'!F37","v":0},{"$f":"+'Manufacturers''s Declaration'!G37","v":0},{"$f":"+'Manufacturers''s Declaration'!H37","v":0},"Power output","[We]",{"$f":"+'Manufacturers''s Declaration'!K37","v":0}]
[null,"Gross electrical efficiency",null,"[%]",{"$f":"+'Manufacturers''s Declaration'!F38","v":0},{"$f":"+'Manufacturers''s Declaration'!G38","v":0},{"$f":"+'Manufacturers''s Declaration'!H38","v":0},"Heat output","[Wt]",{"$f":"+'Manufacturers''s Declaration'!K38","v":0}]
[null,"Gross thermal efficiency",null,"[%]",{"$f":"+'Manufacturers''s Declaration'!F39","v":0},{"$f":"+'Manufacturers''s Declaration'!G39","v":0},{"$f":"+'Manufacturers''s Declaration'!H39","v":0}]
[null,"Gross overall efficiency",null,"[%]",{"$f":"+'Manufacturers''s Declaration'!F40","v":0},{"$f":"+'Manufacturers''s Declaration'!G40","v":0},{"$f":"+'Manufacturers''s Declaration'!H40","v":0}]
[]
[]
[null,"TABLE RT_04:    OPERATING AND TEST REGIMES FOR SPACE HEATING PERFORMANCE TESTS",null,null,null,null,null,null,null,null,null,null,"Add-on MCU type:  ",null,{"$f":"+'Manufacturers''s Declaration'!$E$24","v":"RegPK"},{"$f":"+'Manufacturers''s Declaration'!$F$24","v":"With Ref boiler"}]
[]
[null,"Heating on times",null,null,null,"Operation and test regimes for standard heating performance tests",null,null,null,null,"(OPTIONAL) Operation and test regimes for optional part load heating performance tests"]
{"$rows_left_out":84}
{"sheet":" Installation Package ","index":3,"n_rows":220,"n_cols":23,"rows_kept":220,"cut":false,"hidden":false,"merged":[[214,14,214,15],[53,15,53,18],[28,8,28,10],[29,8,29,10],[27,8,27,10],[50,10,50,11],[53,7,53,9],[53,10,53,14],[38,10,38,14],[63,16,63,19],[153,10,153,11],[195,16,195,18],[196,16,196,18],[197,16,197,18],[180,10,180,11],[156,9,156,10],[28,1,28,4],[31,5,32,5],[30,1,32,4],[8,1,8,4],[8,8,8,10],[11,1,11,4],[10,1,10,4],[9,1,9,4],[10,8,10,10],[12,1,13,3],[12,8,12,10],[13,8,13,10],[15,8,15,10],[16,8,16,10],[14,1,15,4],[14,5,15,5],[5,7,5,8],[17,8,17,10],[35,10,35,11],[20,7,20,8],[23,8,23,10],[26,8,26,9],[11,8,11,10],[25,8,25,9],[14,8,14,10],[38,15,38,18],[54,10,54,12],[60,10,60,11],[38,7,38,9],[91,10,91,13],[147,1,147,3],[148,1,148,3],[149,1,149,3],[53,4,53,6],[63,3,63,4],[145,1,145,3],[142,1,142,3],[63,5,63,7],[138,1,138,3],[137,1,137,3],[136,1,136,3],[16,1,17,3],[130,6,130,7],[23,1,23,4],[24,1,24,4],[25,1,25,4],[129,1,129,3],[129,4,129,7],[26,1,26,4],[88,7,88,8],[70,7,70,8],[73,8,73,9],[63,8,63,10],[38,4,38,6],[39,10,39,12],[63,11,63,15],[64,11,64,13],[183,4,183,6],[183,7,183,9],[183,16,183,18],[190,10,190,11],[193,12,193,14],[193,7,193,9],[193,10,193,11],[183,13,183,14],[193,5,193,6],[214,12,217,12],[150,1,150,3],[194,16,194,18],[212,16,212,18],[209,16,209,18],[210,16,210,18],[211,16,211,18],[198,16,198,18],[199,16,199,18],[200,16,200,18],[201,16,201,18],[202,16,202,18],[203,16,203,18],[204,16,204,18],[207,16,207,18],[208,16,208,18]]}
[]
[null,{"$f":"+'Manufacturers''s Declaration'!B2","v":"Micro-Cogeneration Add-on Calculator "},null,null,null,null,null,null,"Version: ",{"$f":"+'Manufacturers''s Declaration'!J2","v":"v 1.0"}]
[]
[]
[]
[null,"TABLE IS_01: Specification of the boiler and space heating system in the installation dwelling",null,null,null,null,null,"Add-on MCU type:  ",null,{"$f":"+'Manufacturers''s Declaration'!$E$24","v":"RegPK"},{"$f":"+'Manufacturers''s Declaration'!$F$24","v":"With Ref boiler"}]
[]
[null,"TABLE IS_01: Specification of the boiler and space heating system in the installation dwelling"]
[null,null,null,null,null,"Symbol","Unit","Value","Notes"]
[null,"Maximum rating of the boiler - (Heating mode i.e. 80/60oC)",null,null,null,"QTB_MAX","[kW]",null,"Range Min - Max: ",{"$f":"+' Installation Package '!F133","v":0},{"$f":"+E133","v":0}]
[null,"Minimum rating of the boiler - (Heating mode i.e. 80/60oC)",null,null,null,"QTB_MIN","[kW]"]
[null,"Boiler turn down ration (Min/Max)",null,null,null,"BLR_MB","[ - ]",{"$f":"+H11/H10","v":{"$error":"#DIV/0!"}},{"$f":"+IF(H12<H133,\"Out of range\",IF(H12>G133,\"Out of range\",\"Ok\"))","v":{"$error":"#DIV/0!"}}]
[null,"Boiler efficiency",null,null,"Annual","ηA","[%]"]
[null,null,null,null,"DHW","ηDHW","[%]"]
[null,"Maximum power rating of the Add-on MCU system + target boiler (100% Load factor)",null,null,null,"QTSH_MAX","[kW]"]
[null,null,null,null,null,null,"[MJ/24h]",{"$f":"+H15*24*3.6","v":0}]
[null,"Standby power consumption of the target boiler",null,null,"Firing mode","QPB_FM","[W]"]
[null,null,null,null,"Standby mode","QPB_SM","[W]"]
[]
[]
[null,"TABLE IS_02: Specification of the hot water heating system in the installation dwelling",null,null,null,null,null,"Add-on MCU type:  ",null,{"$f":"+'Manufacturers''s Declaration'!$E$24","v":"RegPK"},{"$f":"+'Manufacturers''s Declaration'!$F$24","v":"With Ref boiler"}]
[]
[null,"TABLE IS_02: Specification of the hot water heating system in the installation dwelling",null,null,null,null,null,null,"Building type:  ",{"$f":"+'Manufacturers''s Declaration'!G24","v":"Single family"}]
[null,null,null,null,null,"Symbol","Unit","Value","Notes"]
[null,"Capacity of the hot water storage vessel in the building",null,null,null,"[VHW_STORE]","[L]",null,"Manufacturer's Range:",0,0]
[null,"Manufacturer Declared heat loss rate for the external hot water storage vessel at 45K ΔT (regPK only)",null,null,null,"[HLHWS]","[W]",null,"Max Permissable heat loss:",null,{"$f":"16.66+8.33*(H25^0.4)","v":16.66}]
[null,"Maximum hot water load tested with the reference boiler",null,null,null,"QHW-MAX","[MJ/24h]",{"$f":"+MAX('Reference Test Data'!N83:N85)","v":0},"Max draw limit (MJ/24h]  =",null,{"$f":"+H27*1.25","v":0}]
[null,"Select HW consumption option (assumed by Tapping cycle or L/day]",null,null,null,"[QHW_PROFILE]","[Select]","1)  EU_TC"]
[null,"Daily hot water usage",null,null,null,"[VHW_CON]","[L/day]",null,"Only required if  option L/day is selected above"]
[null,"Select EU Tapping cycle from the list",null,null,null,"[VHW_CON]","[ - ]","2 - M","Only required if  option EU_TC is selected above (EU tapping cycle)"]
[null,"Energy content of hot water consumption",null,null,null,"Volume","[L/day]",{"$f":"+IF(H28=\"1)  EU_TC\",E151,H29)","v":100}]
[null,null,null,null,null,"QTHW","[kWh/24h]",{"$f":"+IF(H28=\"1)  EU_TC\",' Installation Package '!E150,' Installation Package '!F150)","v":5.8450000000000006}]
[null,null,null,null,null,null,"[MJ/24h]",{"$f":"+H32*3.6","v":21.042000000000002},{"$f":"+IF(H33>K27,\"HW Load above limit - Decrease\",\"OK\")","v":"HW Load above limit - Decrease"}]
[]
[]
[null,"TABLE IS_03:       Space heating performance of the Add-on MCU + target secondary system in the installation building",null,null,null,null,null,null,null,null,"Add-on MCU type:  ",null,{"$f":"+'Manufacturers''s Declaration'!$E$24","v":"RegPK"},{"$f":"+'Manufacturers''s Declaration'!$F$24","v":"With Ref boiler"}]
[]
[null,"Table IS_03A:     Add-on MCU + Boiler  space heating performance"]
[null,"Load factor","Heating system","Heating system","Energy for space heating",null,null,"Fuel energy consumption",null,null,"Electricity generation & consumption (Building Plant)",null,null,null,null,"CO2 Emissions"]
[null,null,"Operating mode","Operating regime","Total","Supplied by","Supplied by",null,"Building",null,"Consumption",null,null,"Generation","Net electricity","Fuel","Electricity","Electricity","Net"]
{"$rows_left_out":181}
{"sheet":"Version","index":4,"n_rows":6,"n_cols":4,"rows_kept":6,"cut":false,"hidden":false,"merged":[[1,1,1,2]]}
[]
[null,"AMENDMENTS SINCE PUBLICATION"]
[]
[null,"Date","Version","Notes"]
[null,"2018-11-12",1,"First issue."]
[null,"2019-08-07",1.1000000000000001,"Branding Update"]