{"text_format":"1","workbook":"xlsx","n_sheets":5,"sheets":["Performance Estimate","RHI Graph Generation","LISTS","Version","Sheet1"],"not_rendered":{"charts":2,"images":4,"macros":1,"external_links":0,"defined_names":13,"comments":0,"pivot_tables":0},"unopened":[],"bounds":{"document_bytes":16777216,"sheet_cells":100000,"rows_first":2000,"rows_last":500,"rows_between":2000,"halvings":0,"cell_chars":16384,"cell_head_chars":4096},"cells_cut":0,"cells_raw":0,"read":"whole","date_system":"1900"}

{"sheet":"Performance Estimate","index":0,"n_rows":160,"n_cols":16,"rows_kept":160,"cut":false,"hidden":false,"merged":[[128,5,140,14],[42,3,42,7],[44,3,44,7],[46,3,46,7],[54,3,54,7],[56,3,56,6],[64,4,64,7],[66,4,66,7],[68,4,68,8],[1,9,8,14],[14,4,14,8],[16,4,16,8],[117,1,121,14],[25,13,25,14],[18,4,18,8],[20,4,20,8],[32,9,32,10],[10,4,10,8],[12,4,12,8]]}
[]
[null,null,null,null,null,null,null,null,null,"**Optional Installer Logo**"]
[]
[]
[null,"Heat Pump System Performance Estimate"]
[]
[]
[]
[]
[]
[null,null,"Installer Project Reference"]
[]
[null,null,"   Client "]
[]
[null,null,"Installation Address Line 1"]
[]
[null,null,"Installation Address Line 2"]
[]
[null,null,"Installation Address Line 3"]
[]
[null,null,"Installation Address Line 4"]
[]
[]
[]
[]
[null,null,"Energy Performance Certificate (EPC) Information",null,null,null,null,null,null,null,null,"Fuel Information "]
[null,null,"Is the building existing and not proposed to be extended or reduced in size?",null,null,null,null,"Yes",null,null,null,"(where possible unit rate from customer bills inc. VAT)"]
[]
[null,null,{"$f":"IF(H27=\"Yes\",\"EPC No.\",\"System based on draft EPC\")","v":"EPC No."},null,null,null,null,null,null,null,null,null,"Date on which prices found  "]
[]
[null,null,null,"Energy required to heat property",20000,"  kWh",null,null,null,"Renewable Heat Incentive (RHI) info required  ","Yes"]
[null,null,null,null,null,null,null,null,null,null,null,null,"Existing Fuel","Cost"]
[null,null,null,"Energy required for hot water",3000,"  kWh",null,null,"RHI Funding Stream  ","Domestic",null,null,"Oil (p/litre)"]
[]
[null,null,null,"Potential RHI energy ",{"$f":"IF(D43=\"Air Source Heat Pump\",IF(E36>20000,20000,E36),IF(E36>30000,30000,E36))","v":20000}," kWh",null,null,null,"Ground Source - Shared Ground Loop System","No",null,null,"Cost"]
[null,null,null,null,{"$f":"IF(D55=\"Heating and Hot Water\",(E31+E33),IF(D55=\"Heating Only\",(E31),IF(D55=\"Hot Water Only\",(E33),IF(OR(D55=\"Hybrid - Using current boiler\",D55=\"Hybrid - Using new boiler\"),((E31))*(P55/100)))))","v":23000},null,null,null,{"$f":"IF(D55=\"Heating and Hot Water\",(E31+E33),IF(D55=\"Heating Only\",(E31),IF(D55=\"Hot Water Only\",(E33),IF(OR(D55=\"Hybrid - Using current boiler\",D55=\"Hybrid - Using new boiler\"),((E31))*(P55/100)))))","v":23000},null,null,null,"Electricity (p/kWh)  "]
[null,null,null,"Energy potentially eligible for RHI",{"$f":"IF(OR(J33=\"non-domestic\",AND(K35=\"Yes\",D43=\"Ground Source Heat Pump\",J33=\"non-domestic\")),E35,E35*(1-(1/D51)))","v":14722.955145118734},"  kWh"]
[null,null,null,"(Adjusted using SCoP where applicable)"]
[]
[]
[null,null,"New Renewable System Information"]
[]
[null,null,"Type of System","Air Source Heat Pump",null,null,null,null,"       *This calculator is not designed to be used for Solar Assisted Heat Pumps "]
[]
[null,null,"Manufacturer Name","Manufacturer A"]
[]
[null,null,"Manufacturer Model","Model ABC"]
[]
[null,null,"Flow Temperature",40," °C","* Determined by the temp. of the water leaving the HP when supplying space heating at the external design temp."]
[]
[null,null,"MCS SCOP Heating",{"$f":"VLOOKUP('Performance Estimate'!D49&\"oC\",C128:D159,2)","v":3.79},null,"* SCoP - Seasonal Coefficient of Performance. This value is based on the MCS HP SCoP Table below"]
[]
[null,null,"MCS SCOP Hot Water",{"$f":"IF(D43=\"Ground Source Heat Pump\",2.24,1.75)","v":1.75},null,"* If DHW only, this should be calculated in accordance with Clause 4.3.2 d) of MIS 3005. If providing space heating and DHW, default value from SAP2012"]
[]
[null,null,"Renewable Sytem Provides","Heating and Hot Water",null,null,null,null,null,null,null,null,null,null,"Heat Pump Covers",80]
[]
[null,null,"Hot Water Immersion Use","Once per week",null,null,null,"  * based on 50C up to 60C, 3kW",null,null,null,null,null,null,"New Boiler Efficiency"]
[]
[null,null,"Size of Hot Water Cylinder",200," ltr"]
[]
{"$rows_left_out":101}
{"sheet":"RHI Graph Generation","index":1,"n_rows":91,"n_cols":16,"rows_kept":91,"cut":false,"hidden":true,"merged":[[37,4,37,5],[16,4,16,6],[18,4,18,6],[20,4,20,6],[26,4,26,6],[28,4,28,5],[35,4,35,5]]}
[]
[]
[]
[]
[null,null,"MCS Performance Estimate Template"]
[]
[]
[null,null,"EPC Information",null,null,null,null,null,null,"Fuel Information (Current Prices)"]
[]
[null,null,null,null,"Energy required to heat property",{"$f":"'Performance Estimate'!E31","v":20000},"kWh",null,null,"Gas (p/kWh)",{"$f":"'Performance Estimate'!N33","v":0},null,"Oil (p/litre)",{"$f":"'Performance Estimate'!N36","v":0}]
[]
[null,null,null,null,"Energy required for hot water",{"$f":"'Performance Estimate'!E33","v":3000},"kWh",null,null,"LPG (p/litre)",{"$f":"'Performance Estimate'!N33","v":0},null,"Electricity (p/kWh)",{"$f":"'Performance Estimate'!N36","v":0}]
[]
[]
[null,null,"New Renewable System Information"]
[]
[null,null,null,"Type of System","Ground Source Heat Pump",null,null,null,null,null,"MMSP Included (RHI Uplift)","Yes"]
[]
[null,null,null,"Manufacturer Name",{"$f":"'Performance Estimate'!D45","v":"Manufacturer A"}]
[]
[null,null,null,"Manufacturer Model",{"$f":"'Performance Estimate'!D47","v":"Model ABC"}]
[]
[null,null,null,"Flow Temperature",{"$f":"'Performance Estimate'!D49","v":40},"°C"]
[]
[null,null,null,"Seasonal Heating Efficiency",{"$f":"VLOOKUP(E23&\"oC\",'Performance Estimate'!$C$129:$D$159,2)","v":3.79},null,null,"Seasonal Hot Water Efficiency",{"$f":"'Performance Estimate'!D53","v":1.75}]
[]
[null,null,null,"Renewable Sytem Provides","Heating and Hot Water",null,null,"   *DHW by fossil fuel",null,null,"Renewable System Covers",80,"% of heating energy"]
[]
[null,null,null,"Hot Water Immersion Use",{"$f":"'Performance Estimate'!D57","v":"Once per week"},null,"  * 50C up to 60C, 3kW Immersion",null,null,null,"New Boiler Efficiency",92,"%"]
[]
[null,null,null,"Size of Cylinder",{"$f":"'Performance Estimate'!D59","v":200},"ltr"]
[]
[]
[null,null,"Current Heating System"]
[]
[null,null,null,"Existing heating system fuel",{"$f":"'Performance Estimate'!E65","v":"Oil"}]
[]
[null,null,"Hot water"," DHW heated by",{"$f":"'Performance Estimate'!E67","v":"Oil"}]
[]
[null,null,null,"Old system efficiency",{"$f":"'Performance Estimate'!E71","v":92},"%"]
[]
[]
[null,null,"Running Cost",null,null,null,null,null,null,"Renewable Heat Incentive"]
[]
[null,null,null,null,"Existing system annual running cost",{"$f":"((F10/E40%)*(LOOKUP(E36,LISTS!G2:H5,LISTS!H2:H5)/100))+IF(E38=E36,((F12/E40%)*(LOOKUP(E36,LISTS!G2:H5,LISTS!H2:H5)/100)),((F12)*(N12/100)))","v":0},null,null,null,"RHI Tariff",{"$f":"'Performance Estimate'!K65","v":0},"p/kWh"]
[]
[null,null,null,null,"Renewable System annual running cost",{"$f":"(IF(E27=\"Heating Only\",(F10/E25)*(N12/100),IF(E27=\"Heating and Hot Water\",(F10/E25)*(N12/100),0)+(IF(E27=\"Hot Water Only\",(F12/I25)*(N12/100),IF(E27=\"Heating and Hot Water\",(F12/I25)*(N12/100),IF(OR(E27=\"Hybrid - Using current boiler\",E27=\"Hybrid - Using new boiler\"),(F10/E25)*(N12/100)*(L27/100)))+IF(OR(E27=\"Hybrid - Using current boiler\",E27=\"Hybrid - Using new boiler\",E27=\"Heating Only\"),0,((((E31*4.19*10)/3)/3600)*3)*(N12/100)*IF(E29=\"none\",0,IF(E29=\"Once per day\",365,IF(E29=\"Once per week\",52))))))))","v":0}," *Includes Immersion",null,null,"MMSP per year",{"$f":"IF(L17=\"Yes\",115)","v":115}]
[]
[null,null,null,null,"Fossil Fuel Cost in new system",{"$f":"IF(E27=\"Heating Only\",((F12/E40)*IF(E38=\"Gas\",K10,IF(E38=\"LPG\",(K12/6.6),IF(E38=\"Oil\",(N10/10.27),IF(E38=\"Electric\",N12,IF(E38=\"Immersion\",N12)))))),IF(E27=\"Hot Water Only\",((F10/E40)*IF(E36=\"Gas\",K10,IF(E36=\"LPG\",(K12/6.6),IF(E36=\"Oil\",(N10/10.27),IF(E36=\"Electric\",N12,IF(E36=\"Immersion\",N12)))))),IF(E27=\"Heating and Hot Water\",0,IF(E27=\"Hybrid - Using current boiler\",((F12+(F10*(1-(L27/100))))/E40)*IF(E36=\"Gas\",K10,IF(E36=\"LPG\",(K12/6.6),IF(E36=\"Oil\",(N10/10.27),IF(E36=\"Electric\",N12,IF(E36=\"Immersion\",N12))))),IF(E27=\"Hybrid - Using new boiler\",((F12+(F10*(1-(L27/100))))/L29)*IF(E36=\"Gas\",K10,IF(E36=\"LPG\",(K12/6.6),IF(E36=\"Oil\",(N10/10.27),IF(E36=\"Electric\",N12,IF(E36=\"Immersion\",N12))))))))))","v":0}]
[]
[null,null,null,null,"Annual fuel saving",{"$f":"F45-(F47+F49)","v":0},null,null,null,"RHI per year",{"$f":"(F55*K45/100)+K47","v":115}]
[]
[null,null,null,null,"Fuel saving over the RHI period",{"$f":"F51*7","v":0},null,null,null,"RHI over 7 years",{"$f":"LISTS!O9","v":0},"CPI linkd @",{"$f":"'Performance Estimate'!L91","v":2.3E-2}]
[]
[null,null,null,null,"Renewable heat delivered",{"$f":"IF(E27=\"Heating and Hot Water\",(F10+F12)-((F10+F12)/E25),IF(E27=\"Heating Only\",(F10)-((F10)/E25),IF(E27=\"Hot Water Only\",(F12)-((F12)/E25),IF(OR(E27=\"Hybrid - Using current boiler\",E27=\"Hybrid - Using new boiler\"),((F10)-((F10)/E25))*(L27/100)))))","v":16931.398416886543},"kWh",null,null,"Total fuel saving and RHI",{"$f":"K53+F53","v":0}]
[]
[]
[]
[null,null,"Flow Temp",{"$f":"SCOP[[#Headers],[SCOP]]","v":"SCOP"},"Renew Cost","Fossil Cost","New Annual Running Cost"]
[null,null,35,{"$f":"IF('Performance Estimate'!D129=\"HP Not suitable for this temperature\",0,'Performance Estimate'!D129)","v":4.0199999999999996},{"$f":"(IF($E$27=\"Heating Only\",($F$10/D60)*($N$12/100),IF($E$27=\"Heating and Hot Water\",($F$10/D60)*($N$12/100),0)+(IF($E$27=\"Hot Water Only\",($F$12/$I$25)*($N$12/100),IF($E$27=\"Heating and Hot Water\",($F$12/$I$25)*($N$12/100),IF(OR($E$27=\"Hybrid - Using current boiler\",$E$27=\"Hybrid - Using new boiler\"),($F$10/D60)*($N$12/100)*($L$27/100)))+IF(OR($E$27=\"Hybrid - Using current boiler\",$E$27=\"Hybrid - Using new boiler\",$E$27=\"Heating Only\"),0,(((($E$31*4.19*10)/3)/3600)*3)*($N$12/100)*IF($E$29=\"none\",0,IF($E$29=\"Once per day\",365,IF($E$29=\"Once per week\",52))))))))","v":0},{"$f":"IF(E27=\"Heating Only\",((F12/E40)*IF(E38=\"Gas\",K10,IF(E38=\"LPG\",(K12/6.6),IF(E38=\"Oil\",(N10/10.27),IF(E38=\"Electric\",N12,IF(E38=\"Immersion\",N12)))))),IF(E27=\"Hot Water Only\",((F10/E40)*IF(E36=\"Gas\",K10,IF(E36=\"LPG\",(K12/6.6),IF(E36=\"Oil\",(N10/10.27),IF(E36=\"Electric\",N12,IF(E36=\"Immersion\",N12)))))),IF(E27=\"Heating and Hot Water\",0)))","v":0},{"$f":"IF(D60=0,F60,F60+E60)","v":0},null,{"$f":"E23","v":40},{"$f":"ROUNDUP(MAX(G60:G80),-2)","v":0}]
{"$rows_left_out":32}
{"sheet":"LISTS","index":2,"n_rows":32,"n_cols":31,"rows_kept":32,"cut":false,"hidden":true,"merged":[]}
["Type of System","Renewable System Provides","Old Heating System","MMSP","Immersion use",null,"Existing system fuel","p/kWh","DHW",null,"MMSM Package ","flow temp","Boiler Efficiency",null,"Capital Payback",null,null,null,null,null,"RHI Info Reqd","Existing system age","Building ext.","Shared ground loop",null,"MMSP","RHI Stream",null,"Calorific values",null,"Fuel list"]
["Air Source Heat Pump","Heating and Hot Water","Gas Boiler","Yes","None","Electric (p/kWh)","Electric",{"$f":"'Performance Estimate'!N36/(AD2)","v":0},"Electric","ASHP",115,35,90,null,7,"Years","CPI @",{"$f":"'Performance Estimate'!L91","v":2.3E-2},null,null,"Yes","Pre-1994","Yes","Yes",null,"Yes","Domestic",null,"Electric",1,"Gas (p/kWh)"]
["Ground Source Heat Pump","Heating Only","Oil Boiler","No","Once per day","Gas (p/kWh)","Gas",{"$f":"IF('Performance Estimate'!M33=\"Gas (p/kWh)\",'Performance Estimate'!N33/AD3,0)","v":0},"Gas","GSHP",null,36,89,null,{"$f":"'Performance Estimate'!M85","v":0},1,{"$f":"'Performance Estimate'!M85","v":0},{"$f":"Q3-$O$3","v":0},{"$f":"R3","v":0},null,"No","1994-2007","No","No",null,"No","Non-Domestic",null,"Gas",1,"LPG (p/litre)"]
[null,"Hot Water Only","Solid Fuel Boiler",null,"Once per week","LPG (p/litre)","LPG",{"$f":"IF('Performance Estimate'!M33=\"LPG (p/litre)\",'Performance Estimate'!N33/AD4,0)","v":0},"LPG",null,null,37,88,null,null,2,{"$f":"Q3+(Q3*$R$2)","v":0},{"$f":"Q4-$O$3","v":0},{"$f":"R4+S3","v":0},null,null,"Post-2007",null,null,null,null,null,null,"LPG",6.66,"Oil (p/litre)"]
[null,"Hybrid - Using current boiler","Electric - Storage",null,null,"Oil (p/litre)","Oil",{"$f":"IF('Performance Estimate'!M33=\"Oil (p/litre)\",'Performance Estimate'!N33/AD5,0)","v":0},"Oil",null,null,38,87,null,null,3,{"$f":"Q4+(Q4*$R$2)","v":0},0,{"$f":"R5+S4","v":0},null,null,null,null,null,null,null,null,null,"Oil",9.8000000000000007,"Electricity (p/kWh)"]
[null,"Hybrid - Using new boiler","Electric - Resistance Heaters",null,null,null,"Air Source Heat Pump",{"$f":"H2/AD6","v":0},"Air Source Heat Pump",null,null,39,86,null,null,4,0,0,0,null,null,null,null,null,null,null,null,null,"Air Source Heat Pump",2.5,"Smokeless Fuel (p/kg)"]
[null,null,null,null,null,null,"Ground Source Heat Pump",{"$f":"H2/AD7","v":0},"Ground Source Heat Pump",null,null,40,85,null,null,5,0,0,0,null,null,null,null,null,null,null,null,null,"Ground Source Heat Pump",3,"Coal (p/kg)"]
[null,null,null,null,null,"Smokeless Fuel (p/kg)","Smokeless Fuel",{"$f":"IF('Performance Estimate'!M33=\"Smokeless Fuel (p/kg)\",'Performance Estimate'!N33/LISTS!AD8,0)","v":0},"Smokeless Fuel",null,null,41,84,null,null,6,0,0,0,null,null,null,null,null,null,null,null,null,"Smokeless Fuel",6.7,"Pellets (p/kg)"]
[null,null,null,null,null,"Coal (p/kg)","Coal",{"$f":"IF('Performance Estimate'!M33=\"Coal (p/kg)\",'Performance Estimate'!N33/LISTS!AD9,0)","v":0},"Coal",null,null,42,83,"Total",{"$f":"SUM(Q3:Q9)","v":0},7,0,0,0,null,null,null,null,null,null,null,null,null,"Coal",6.85,"Seasoned Wood (p/kg)"]
[null,null,null,null,null,"Seasoned wood (p/kg)","Seasoned Wood",{"$f":"IF('Performance Estimate'!M33=\"Seasoned Wood (p/kg)\",'Performance Estimate'!N33/LISTS!AD10,0)","v":0},"Seasoned Wood",null,null,43,82,null,null,8,0,0,0,null,null,null,null,null,null,null,null,null,"Seasoned Wood",4.2]
[null,null,null,null,null,"Pellets (p/kg)","Pellets",{"$f":"IF('Performance Estimate'!M33=\"Pellets (p/kg)\",'Performance Estimate'!N33/LISTS!AD11,0)","v":0},"Pellets",null,null,44,81,null,null,9,0,0,0,null,null,null,null,null,null,null,null,null,"Pellets",4.72]
[null,null,null,null,null,null,"Immersion",{"$f":"H2","v":0},"Immersion",null,null,45,80,null,null,10,0,0,0]
[null,null,null,null,null,null,null,null,null,null,null,46,79,null,null,11,0,0,0]
[null,null,null,null,null,null,null,null,null,null,null,47,78,null,null,12,0,0,0]
[null,null,null,null,null,null,null,null,null,null,null,48,77,null,null,13,0,0,0]
[null,null,null,null,null,null,null,null,null,null,null,49,76,null,null,14,0,0,0]
[null,null,null,null,null,null,null,null,null,null,null,50,75,null,null,15,0,0,0]
[null,null,null,null,null,null,null,null,null,null,null,51,74,null,null,16,0,0,0]
[null,null,null,null,null,null,null,null,null,null,null,52,73,null,null,17,0,0,0]
[null,null,null,null,null,null,null,null,null,null,null,53,72,null,null,18,0,0,{"$f":"R20+S19","v":0}]
[null,null,null,null,null,null,null,null,null,null,null,54,71,null,null,19,0,0,0]
[null,null,null,null,null,null,null,null,null,null,null,55,70,"Total",{"$f":"SUM(Q3:Q22)","v":0},20,0,0,0]
[null,null,null,null,null,null,null,null,null,null,null,56,69]
[null,null,null,null,null,null,null,null,null,null,null,57,68]
[null,null,null,null,null,null,null,null,null,null,null,58,67]
[null,null,null,null,null,null,null,null,null,null,null,59,66]
[null,null,null,null,null,null,null,null,null,null,null,60,65]
[null,null,null,null,null,null,null,null,null,null,null,61]
[null,null,null,null,null,null,null,null,null,null,null,62]
[null,null,null,null,null,null,null,null,null,null,null,63]
[null,null,null,null,null,null,null,null,null,null,null,64]
[null,null,null,null,null,null,null,null,null,null,null,65]

{"sheet":"Version","index":3,"n_rows":7,"n_cols":4,"rows_kept":7,"cut":false,"hidden":false,"merged":[]}
[]
[null,"AMENDMENTS SINCE PUBLICATION"]
[]
[null,"Date","Version","Notes"]
[null,"2017-09-19",1,"First issue."]
[null,"2018-05-22",2,"Inclusion of installation address and customer details\nLink to CPI to enable updates by MCS Contractors as CPI changes\nDate and installer project reference\nUpdate to include default SAP DHW figures to 1.75 for ASHPs and 2.24 for GSHPs where system is providing space heating and hot water. If the system is providing hot water only, this should be calculated in accordance with Clause 4.3.2 d) of MIS 3005\nAddition of EPC option that heat demand is based on draft EPC using SAP for new or custom builds\nAddition of RHI funding stream option – (non-domestic for shared ground loop GSHPs)\nAmended Age of existing system ranges to be within years (e.g. post-2007) rather than less than 10 years \nUnlock RHI Tariff cell to enable updates by MCS Contractors as tariffs change\nAddition of a note to state that the fuel values include VAT\nAmendment the calorific values in the value look up table\nAddition of ASHP and GSHP systems for the existing heating system fuel type\nNote added to clarify that the RHI is correct within the 7-year payback period\nAmendment to the SCOP table of values to zero\nUpdate the Annual Running Cost graph in the PET to include VHTHPs (55-65 degrees)\nAddition of MCS reference and version number to each page\nAddition of note that MMSP is only applicable for Domestic RHI\nClarification with a note of where RHI payments are deemed and when they are metered"]
[null,"2019-07-31",2.1,"Updated for the replacement of brand elements including fonts and logos. "]

{"sheet":"Sheet1","index":4,"n_rows":0,"n_cols":0,"rows_kept":0,"cut":false,"hidden":true,"merged":[]}